Application startup failed - na versão 3.3.9 migrada da 2.5.6
28/09/2019 14:06
0
Olá amigos.

Quem poderia me ajudar?

BUILD SUCCESSFUL
Total time: 2 mins 6.218 secs
| Running application...
:compileJava NO-SOURCE
:compileGroovy UP-TO-DATE
:buildProperties
:processResources UP-TO-DATE
:classes UP-TO-DATE
:findMainClass
:bootRun
2019-09-28 13:56:29.088 ERROR --- [  main] o.s.boot.SpringApplication : Application startup failed
org.springframework.beans.factory.UnsatisfiedDependencyException: Error creating bean with name 'methodValidationPostProcessor' defined in class path resource [org/springframework/boot/autoconfigure/validat
ion/ValidationAutoConfiguration.class]: Unsatisfied dependency expressed through method 'methodValidationPostProcessor' parameter 0; nested exception is org.springframework.beans.factory.BeanCreationExcepti
on: Error creating bean with name 'hibernateDatastoreServiceRegistry': Cannot resolve reference to bean 'hibernateDatastore' while setting constructor argument; nested exception is org.springframework.beans
.factory.BeanCreationException: Error creating bean with name 'hibernateDatastore': Bean instantiation via constructor failed; nested exception is org.springframework.beans.BeanInstantiationException: Faile
d to instantiate [org.grails.orm.hibernate.HibernateDatastore]: Constructor threw exception; nested exception is groovy.lang.MissingPropertyException: No such property: org for class: org.grails.orm.hiberna
te.cfg.HibernateMappingBuilder
Possible solutions: LOG
  at org.springframework.beans.factory.support.ConstructorResolver.createArgumentArray(ConstructorResolver.java:749)
  at org.springframework.beans.factory.support.ConstructorResolver.instantiateUsingFactoryMethod(ConstructorResolver.java:467)
  at org.springframework.beans.factory.support.AbstractAutowireCapableBeanFactory.instantiateUsingFactoryMethod(AbstractAutowireCapableBeanFactory.java:1178)
  at org.springframework.beans.factory.support.AbstractAutowireCapableBeanFactory.createBeanInstance(AbstractAutowireCapableBeanFactory.java:1072)
  at org.springframework.beans.factory.support.AbstractAutowireCapableBeanFactory.doCreateBean(AbstractAutowireCapableBeanFactory.java:511)
  at org.springframework.beans.factory.support.AbstractAutowireCapableBeanFactory.createBean(AbstractAutowireCapableBeanFactory.java:481)
  at org.springframework.beans.factory.support.AbstractBeanFactory$1.getObject(AbstractBeanFactory.java:312)
  at org.springframework.beans.factory.support.DefaultSingletonBeanRegistry.getSingleton(DefaultSingletonBeanRegistry.java:230)
  at org.springframework.beans.factory.support.AbstractBeanFactory.doGetBean(AbstractBeanFactory.java:308)
  at org.springframework.beans.factory.support.AbstractBeanFactory.getBean(AbstractBeanFactory.java:202)
  at org.springframework.context.support.PostProcessorRegistrationDelegate.registerBeanPostProcessors(PostProcessorRegistrationDelegate.java:225)
  at org.springframework.context.support.AbstractApplicationContext.registerBeanPostProcessors(AbstractApplicationContext.java:703)
  at org.springframework.context.support.AbstractApplicationContext.refresh(AbstractApplicationContext.java:528)
  at org.springframework.boot.context.embedded.EmbeddedWebApplicationContext.refresh(EmbeddedWebApplicationContext.java:124)
  at org.springframework.boot.SpringApplication.refresh(SpringApplication.java:693)
  at org.springframework.boot.SpringApplication.refreshContext(SpringApplication.java:360)
  at org.springframework.boot.SpringApplication.run(SpringApplication.java:303)
  at grails.boot.GrailsApp.run(GrailsApp.groovy:84)
  at grails.boot.GrailsApp.run(GrailsApp.groovy:393)
  at grails.boot.GrailsApp.run(GrailsApp.groovy:380)
  at grails.boot.GrailsApp$run.call(Unknown Source)
  at org.codehaus.groovy.runtime.callsite.CallSiteArray.defaultCall(CallSiteArray.java:47)
  at org.codehaus.groovy.runtime.callsite.AbstractCallSite.call(AbstractCallSite.java:116)
  at org.codehaus.groovy.runtime.callsite.AbstractCallSite.call(AbstractCallSite.java:136)
  at jobeasier3.Application.main(Application.groovy:9)
Caused by: org.springframework.beans.factory.BeanCreationException: Error creating bean with name 'hibernateDatastoreServiceRegistry': Cannot resolve reference to bean 'hibernateDatastore' while setting con
structor argument; nested exception is org.springframework.beans.factory.BeanCreationException: Error creating bean with name 'hibernateDatastore': Bean instantiation via constructor failed; nested exceptio
n is org.springframework.beans.BeanInstantiationException: Failed to instantiate [org.grails.orm.hibernate.HibernateDatastore]: Constructor threw exception; nested exception is groovy.lang.MissingPropertyEx
ception: No such property: org for class: org.grails.orm.hibernate.cfg.HibernateMappingBuilder
Possible solutions: LOG
  at org.springframework.beans.factory.support.BeanDefinitionValueResolver.resolveReference(BeanDefinitionValueResolver.java:359)
  at org.springframework.beans.factory.support.BeanDefinitionValueResolver.resolveValueIfNecessary(BeanDefinitionValueResolver.java:108)
  at org.springframework.beans.factory.support.ConstructorResolver.resolveConstructorArguments(ConstructorResolver.java:648)
  at org.springframework.beans.factory.support.ConstructorResolver.autowireConstructor(ConstructorResolver.java:145)
  at org.springframework.beans.factory.support.AbstractAutowireCapableBeanFactory.autowireConstructor(AbstractAutowireCapableBeanFactory.java:1198)
  at org.springframework.beans.factory.support.AbstractAutowireCapableBeanFactory.createBeanInstance(AbstractAutowireCapableBeanFactory.java:1100)
  at org.springframework.beans.factory.support.AbstractAutowireCapableBeanFactory.getSingletonFactoryBeanForTypeCheck(AbstractAutowireCapableBeanFactory.java:928)
  at org.springframework.beans.factory.support.AbstractAutowireCapableBeanFactory.getTypeForFactoryBean(AbstractAutowireCapableBeanFactory.java:805)
  at org.springframework.beans.factory.support.AbstractBeanFactory.isTypeMatch(AbstractBeanFactory.java:573)
  at org.springframework.beans.factory.support.DefaultListableBeanFactory.doGetBeanNamesForType(DefaultListableBeanFactory.java:432)
  at org.springframework.beans.factory.support.DefaultListableBeanFactory.getBeanNamesForType(DefaultListableBeanFactory.java:395)
  at org.springframework.beans.factory.BeanFactoryUtils.beanNamesForTypeIncludingAncestors(BeanFactoryUtils.java:206)
  at org.springframework.beans.factory.support.DefaultListableBeanFactory.findAutowireCandidates(DefaultListableBeanFactory.java:1265)
  at org.springframework.beans.factory.support.DefaultListableBeanFactory.doResolveDependency(DefaultListableBeanFactory.java:1099)
  at org.springframework.beans.factory.support.DefaultListableBeanFactory.resolveDependency(DefaultListableBeanFactory.java:1064)
  at org.springframework.beans.factory.support.ConstructorResolver.resolveAutowiredArgument(ConstructorResolver.java:835)
  at org.springframework.beans.factory.support.ConstructorResolver.createArgumentArray(ConstructorResolver.java:741)
  ... 24 common frames omitted
Caused by: org.springframework.beans.factory.BeanCreationException: Error creating bean with name 'hibernateDatastore': Bean instantiation via constructor failed; nested exception is org.springframework.bea
ns.BeanInstantiationException: Failed to instantiate [org.grails.orm.hibernate.HibernateDatastore]: Constructor threw exception; nested exception is groovy.lang.MissingPropertyException: No such property: o
rg for class: org.grails.orm.hibernate.cfg.HibernateMappingBuilder
Possible solutions: LOG
  at org.springframework.beans.factory.support.ConstructorResolver.autowireConstructor(ConstructorResolver.java:279)
  at org.springframework.beans.factory.support.AbstractAutowireCapableBeanFactory.autowireConstructor(AbstractAutowireCapableBeanFactory.java:1198)
  at org.springframework.beans.factory.support.AbstractAutowireCapableBeanFactory.createBeanInstance(AbstractAutowireCapableBeanFactory.java:1100)
  at org.springframework.beans.factory.support.AbstractAutowireCapableBeanFactory.doCreateBean(AbstractAutowireCapableBeanFactory.java:511)
  at org.springframework.beans.factory.support.AbstractAutowireCapableBeanFactory.createBean(AbstractAutowireCapableBeanFactory.java:481)
  at org.springframework.beans.factory.support.AbstractBeanFactory$1.getObject(AbstractBeanFactory.java:312)
  at org.springframework.beans.factory.support.DefaultSingletonBeanRegistry.getSingleton(DefaultSingletonBeanRegistry.java:230)
  at org.springframework.beans.factory.support.AbstractBeanFactory.doGetBean(AbstractBeanFactory.java:308)
  at org.springframework.beans.factory.support.AbstractBeanFactory.getBean(AbstractBeanFactory.java:197)
  at org.springframework.beans.factory.support.BeanDefinitionValueResolver.resolveReference(BeanDefinitionValueResolver.java:351)
  ... 40 common frames omitted
Caused by: org.springframework.beans.BeanInstantiationException: Failed to instantiate [org.grails.orm.hibernate.HibernateDatastore]: Constructor threw exception; nested exception is groovy.lang.MissingProp
ertyException: No such property: org for class: org.grails.orm.hibernate.cfg.HibernateMappingBuilder
Possible solutions: LOG
  at org.springframework.beans.BeanUtils.instantiateClass(BeanUtils.java:154)
  at org.springframework.beans.factory.support.SimpleInstantiationStrategy.instantiate(SimpleInstantiationStrategy.java:122)
  at org.springframework.beans.factory.support.ConstructorResolver.autowireConstructor(ConstructorResolver.java:271)
  ... 49 common frames omitted
Caused by: groovy.lang.MissingPropertyException: No such property: org for class: org.grails.orm.hibernate.cfg.HibernateMappingBuilder
Possible solutions: LOG
  at org.codehaus.groovy.runtime.ScriptBytecodeAdapter.unwrap(ScriptBytecodeAdapter.java:66)
  at org.codehaus.groovy.runtime.callsite.PogoGetPropertySite.getProperty(PogoGetPropertySite.java:51)
  at org.codehaus.groovy.runtime.callsite.AbstractCallSite.callGroovyObjectGetProperty(AbstractCallSite.java:310)
  at script15696897287711902417924$_run_closure1.doCall(script15696897287711902417924.groovy:4)
  at sun.reflect.NativeMethodAccessorImpl.invoke0(Native Method)
  at sun.reflect.NativeMethodAccessorImpl.invoke(NativeMethodAccessorImpl.java:62)
  at sun.reflect.DelegatingMethodAccessorImpl.invoke(DelegatingMethodAccessorImpl.java:43)
  at java.lang.reflect.Method.invoke(Method.java:498)
  at org.springsource.loaded.ri.ReflectiveInterceptor.jlrMethodInvoke(ReflectiveInterceptor.java:1427)
  at org.codehaus.groovy.reflection.CachedMethod.invoke(CachedMethod.java:98)
  at groovy.lang.MetaMethod.doMethodInvoke(MetaMethod.java:325)
  at org.codehaus.groovy.runtime.metaclass.ClosureMetaClass.invokeMethod(ClosureMetaClass.java:264)
  at groovy.lang.MetaClassImpl.invokeMethod(MetaClassImpl.java:1034)
  at groovy.lang.Closure.call(Closure.java:418)
  at groovy.lang.Closure.call(Closure.java:434)
  at org.grails.orm.hibernate.cfg.HibernateMappingBuilder.evaluate(HibernateMappingBuilder.groovy:88)
  at org.grails.orm.hibernate.cfg.HibernateMappingBuilder.evaluate(HibernateMappingBuilder.groovy)
  at org.grails.datastore.mapping.config.AbstractGormMappingFactory.evaluateWithContext(AbstractGormMappingFactory.java:108)
  at org.grails.datastore.mapping.config.AbstractGormMappingFactory.createMappedForm(AbstractGormMappingFactory.java:79)
  at org.grails.orm.hibernate.cfg.HibernateMappingContext$HibernateMappingFactory.createIdentityMapping(HibernateMappingContext.java:264)
  at org.grails.datastore.mapping.model.config.GormMappingConfigurationStrategy.getIdentityMapping(GormMappingConfigurationStrategy.java:928)
  at org.grails.datastore.mapping.model.config.JpaMappingConfigurationStrategy.getIdentityMapping(JpaMappingConfigurationStrategy.java:289)
  at org.grails.datastore.mapping.model.AbstractClassMapping.<init>(AbstractClassMapping.java:35)
  at org.grails.orm.hibernate.cfg.HibernatePersistentEntity$1.<init>(HibernatePersistentEntity.java:35)
  at org.grails.orm.hibernate.cfg.HibernatePersistentEntity.<init>(HibernatePersistentEntity.java:35)
  at org.grails.orm.hibernate.cfg.HibernateMappingContext.createPersistentEntity(HibernateMappingContext.java:150)
  at org.grails.datastore.mapping.model.AbstractMappingContext.addPersistentEntities(AbstractMappingContext.java:274)
  at org.grails.orm.hibernate.cfg.HibernateMappingContext.<init>(HibernateMappingContext.java:76)
  at org.grails.orm.hibernate.connections.HibernateConnectionSourceFactory.buildConfiguration(HibernateConnectionSourceFactory.java:94)
  at org.grails.orm.hibernate.connections.HibernateConnectionSourceFactory.create(HibernateConnectionSourceFactory.java:85)
  at org.grails.orm.hibernate.connections.AbstractHibernateConnectionSourceFactory.create(AbstractHibernateConnectionSourceFactory.java:39)
  at org.grails.orm.hibernate.connections.AbstractHibernateConnectionSourceFactory.create(AbstractHibernateConnectionSourceFactory.java:23)
  at org.grails.datastore.mapping.core.connections.AbstractConnectionSourceFactory.create(AbstractConnectionSourceFactory.java:64)
  at org.grails.datastore.mapping.core.connections.AbstractConnectionSourceFactory.create(AbstractConnectionSourceFactory.java:52)
  at org.grails.datastore.mapping.core.connections.ConnectionSourcesInitializer.create(ConnectionSourcesInitializer.groovy:24)
  at org.grails.orm.hibernate.HibernateDatastore.<init>(HibernateDatastore.java:201)
  at sun.reflect.NativeConstructorAccessorImpl.newInstance0(Native Method)
  at sun.reflect.NativeConstructorAccessorImpl.newInstance(NativeConstructorAccessorImpl.java:62)
  at sun.reflect.DelegatingConstructorAccessorImpl.newInstance(DelegatingConstructorAccessorImpl.java:45)
  at java.lang.reflect.Constructor.newInstance(Constructor.java:423)
  at org.springsource.loaded.ri.ReflectiveInterceptor.jlrConstructorNewInstance(ReflectiveInterceptor.java:1076)
  at org.springframework.beans.BeanUtils.instantiateClass(BeanUtils.java:142)
  ... 51 common frames omitted
:bootRun FAILED
FAILURE: Build failed with an exception.
* What went wrong:
Execution failed for task ':bootRun'.
> Process 'command 'C:\Program Files\Java\jdk1.8.0_201\bin\java.exe'' finished with non-zero exit value 1
* Try:
Run with --info or --debug option to get more log output.
* Exception is:
org.gradle.api.tasks.TaskExecutionException: Execution failed for task ':bootRun'.
  at org.gradle.api.internal.tasks.execution.ExecuteActionsTaskExecuter.executeActions(ExecuteActionsTaskExecuter.java:98)
  at org.gradle.api.internal.tasks.execution.ExecuteActionsTaskExecuter.execute(ExecuteActionsTaskExecuter.java:68)
  at org.gradle.api.internal.tasks.execution.SkipUpToDateTaskExecuter.execute(SkipUpToDateTaskExecuter.java:62)
  at org.gradle.api.internal.tasks.execution.ValidatingTaskExecuter.execute(ValidatingTaskExecuter.java:58)
  at org.gradle.api.internal.tasks.execution.SkipEmptySourceFilesTaskExecuter.execute(SkipEmptySourceFilesTaskExecuter.java:88)
  at org.gradle.api.internal.tasks.execution.ResolveTaskArtifactStateTaskExecuter.execute(ResolveTaskArtifactStateTaskExecuter.java:46)
  at org.gradle.api.internal.tasks.execution.SkipTaskWithNoActionsExecuter.execute(SkipTaskWithNoActionsExecuter.java:51)
  at org.gradle.api.internal.tasks.execution.SkipOnlyIfTaskExecuter.execute(SkipOnlyIfTaskExecuter.java:54)
  at org.gradle.api.internal.tasks.execution.ExecuteAtMostOnceTaskExecuter.execute(ExecuteAtMostOnceTaskExecuter.java:43)
  at org.gradle.api.internal.tasks.execution.CatchExceptionTaskExecuter.execute(CatchExceptionTaskExecuter.java:34)
  at org.gradle.execution.taskgraph.DefaultTaskGraphExecuter$EventFiringTaskWorker$1.execute(DefaultTaskGraphExecuter.java:236)
  at org.gradle.execution.taskgraph.DefaultTaskGraphExecuter$EventFiringTaskWorker$1.execute(DefaultTaskGraphExecuter.java:228)
  at org.gradle.internal.Transformers$4.transform(Transformers.java:169)
  at org.gradle.internal.progress.DefaultBuildOperationExecutor.run(DefaultBuildOperationExecutor.java:106)
  at org.gradle.internal.progress.DefaultBuildOperationExecutor.run(DefaultBuildOperationExecutor.java:61)
  at org.gradle.execution.taskgraph.DefaultTaskGraphExecuter$EventFiringTaskWorker.execute(DefaultTaskGraphExecuter.java:228)
  at org.gradle.execution.taskgraph.DefaultTaskGraphExecuter$EventFiringTaskWorker.execute(DefaultTaskGraphExecuter.java:215)
  at org.gradle.execution.taskgraph.AbstractTaskPlanExecutor$TaskExecutorWorker.processTask(AbstractTaskPlanExecutor.java:77)
  at org.gradle.execution.taskgraph.AbstractTaskPlanExecutor$TaskExecutorWorker.run(AbstractTaskPlanExecutor.java:58)
  at org.gradle.execution.taskgraph.DefaultTaskPlanExecutor.process(DefaultTaskPlanExecutor.java:32)
  at org.gradle.execution.taskgraph.DefaultTaskGraphExecuter.execute(DefaultTaskGraphExecuter.java:113)
  at org.gradle.execution.SelectedTaskExecutionAction.execute(SelectedTaskExecutionAction.java:37)
  at org.gradle.execution.DefaultBuildExecuter.execute(DefaultBuildExecuter.java:37)
  at org.gradle.execution.DefaultBuildExecuter.access$000(DefaultBuildExecuter.java:23)
  at org.gradle.execution.DefaultBuildExecuter$1.proceed(DefaultBuildExecuter.java:43)
  at org.gradle.execution.DryRunBuildExecutionAction.execute(DryRunBuildExecutionAction.java:32)
  at org.gradle.execution.DefaultBuildExecuter.execute(DefaultBuildExecuter.java:37)
  at org.gradle.execution.DefaultBuildExecuter.execute(DefaultBuildExecuter.java:30)
  at org.gradle.initialization.DefaultGradleLauncher$RunTasksAction.execute(DefaultGradleLauncher.java:230)
  at org.gradle.initialization.DefaultGradleLauncher$RunTasksAction.execute(DefaultGradleLauncher.java:227)
  at org.gradle.internal.Transformers$4.transform(Transformers.java:169)
  at org.gradle.internal.progress.DefaultBuildOperationExecutor.run(DefaultBuildOperationExecutor.java:106)
  at org.gradle.internal.progress.DefaultBuildOperationExecutor.run(DefaultBuildOperationExecutor.java:56)
  at org.gradle.initialization.DefaultGradleLauncher.doBuildStages(DefaultGradleLauncher.java:161)
  at org.gradle.initialization.DefaultGradleLauncher.doBuild(DefaultGradleLauncher.java:112)
  at org.gradle.initialization.DefaultGradleLauncher.run(DefaultGradleLauncher.java:95)
  at org.gradle.launcher.exec.GradleBuildController.run(GradleBuildController.java:66)
  at org.gradle.tooling.internal.provider.runner.BuildModelActionRunner.run(BuildModelActionRunner.java:50)
  at org.gradle.launcher.exec.ChainingBuildActionRunner.run(ChainingBuildActionRunner.java:35)
  at org.gradle.tooling.internal.provider.runner.RunAsBuildOperationBuildActionRunner$1.execute(RunAsBuildOperationBuildActionRunner.java:43)
  at org.gradle.tooling.internal.provider.runner.RunAsBuildOperationBuildActionRunner$1.execute(RunAsBuildOperationBuildActionRunner.java:40)
  at org.gradle.internal.Transformers$4.transform(Transformers.java:169)
  at org.gradle.internal.progress.DefaultBuildOperationExecutor.run(DefaultBuildOperationExecutor.java:106)
  at org.gradle.internal.progress.DefaultBuildOperationExecutor.run(DefaultBuildOperationExecutor.java:56)
  at org.gradle.tooling.internal.provider.runner.RunAsBuildOperationBuildActionRunner.run(RunAsBuildOperationBuildActionRunner.java:40)
  at org.gradle.tooling.internal.provider.runner.SubscribableBuildActionRunner.run(SubscribableBuildActionRunner.java:88)
  at org.gradle.launcher.exec.ChainingBuildActionRunner.run(ChainingBuildActionRunner.java:35)
  at org.gradle.launcher.exec.InProcessBuildActionExecuter.execute(InProcessBuildActionExecuter.java:41)
  at org.gradle.launcher.exec.InProcessBuildActionExecuter.execute(InProcessBuildActionExecuter.java:26)
  at org.gradle.tooling.internal.provider.ContinuousBuildActionExecuter.execute(ContinuousBuildActionExecuter.java:75)
  at org.gradle.tooling.internal.provider.ContinuousBuildActionExecuter.execute(ContinuousBuildActionExecuter.java:49)
  at org.gradle.tooling.internal.provider.ServicesSetupBuildActionExecuter.execute(ServicesSetupBuildActionExecuter.java:49)
  at org.gradle.tooling.internal.provider.ServicesSetupBuildActionExecuter.execute(ServicesSetupBuildActionExecuter.java:31)
  at org.gradle.launcher.daemon.server.exec.ExecuteBuild.doBuild(ExecuteBuild.java:67)
  at org.gradle.launcher.daemon.server.exec.BuildCommandOnly.execute(BuildCommandOnly.java:36)
  at org.gradle.launcher.daemon.server.api.DaemonCommandExecution.proceed(DaemonCommandExecution.java:120)
  at org.gradle.launcher.daemon.server.exec.WatchForDisconnection.execute(WatchForDisconnection.java:37)
  at org.gradle.launcher.daemon.server.api.DaemonCommandExecution.proceed(DaemonCommandExecution.java:120)
  at org.gradle.launcher.daemon.server.exec.ResetDeprecationLogger.execute(ResetDeprecationLogger.java:26)
  at org.gradle.launcher.daemon.server.api.DaemonCommandExecution.proceed(DaemonCommandExecution.java:120)
  at org.gradle.launcher.daemon.server.exec.RequestStopIfSingleUsedDaemon.execute(RequestStopIfSingleUsedDaemon.java:34)
  at org.gradle.launcher.daemon.server.api.DaemonCommandExecution.proceed(DaemonCommandExecution.java:120)
  at org.gradle.launcher.daemon.server.exec.ForwardClientInput$2.call(ForwardClientInput.java:74)
  at org.gradle.launcher.daemon.server.exec.ForwardClientInput$2.call(ForwardClientInput.java:72)
  at org.gradle.util.Swapper.swap(Swapper.java:38)
  at org.gradle.launcher.daemon.server.exec.ForwardClientInput.execute(ForwardClientInput.java:72)
  at org.gradle.launcher.daemon.server.api.DaemonCommandExecution.proceed(DaemonCommandExecution.java:120)
  at org.gradle.launcher.daemon.server.exec.LogAndCheckHealth.execute(LogAndCheckHealth.java:55)
  at org.gradle.launcher.daemon.server.api.DaemonCommandExecution.proceed(DaemonCommandExecution.java:120)
  at org.gradle.launcher.daemon.server.exec.LogToClient.doBuild(LogToClient.java:60)
  at org.gradle.launcher.daemon.server.exec.BuildCommandOnly.execute(BuildCommandOnly.java:36)
  at org.gradle.launcher.daemon.server.api.DaemonCommandExecution.proceed(DaemonCommandExecution.java:120)
  at org.gradle.launcher.daemon.server.exec.EstablishBuildEnvironment.doBuild(EstablishBuildEnvironment.java:72)
  at org.gradle.launcher.daemon.server.exec.BuildCommandOnly.execute(BuildCommandOnly.java:36)
  at org.gradle.launcher.daemon.server.api.DaemonCommandExecution.proceed(DaemonCommandExecution.java:120)
  at org.gradle.launcher.daemon.server.exec.StartBuildOrRespondWithBusy$1.run(StartBuildOrRespondWithBusy.java:50)
  at org.gradle.launcher.daemon.server.DaemonStateCoordinator$1.run(DaemonStateCoordinator.java:297)
  at org.gradle.internal.concurrent.ExecutorPolicy$CatchAndRecordFailures.onExecute(ExecutorPolicy.java:63)
  at org.gradle.internal.concurrent.StoppableExecutorImpl$1.run(StoppableExecutorImpl.java:46)
Caused by: org.gradle.process.internal.ExecException: Process 'command 'C:\Program Files\Java\jdk1.8.0_201\bin\java.exe'' finished with non-zero exit value 1
  at org.gradle.process.internal.DefaultExecHandle$ExecResultImpl.assertNormalExitValue(DefaultExecHandle.java:369)
  at org.gradle.process.internal.DefaultJavaExecAction.execute(DefaultJavaExecAction.java:31)
  at org.gradle.api.tasks.JavaExec.exec(JavaExec.java:74)
  at org.springframework.boot.gradle.run.BootRunTask.exec(BootRunTask.java:62)
  at org.gradle.internal.reflect.JavaMethod.invoke(JavaMethod.java:73)
  at org.gradle.api.internal.project.taskfactory.DefaultTaskClassInfoStore$StandardTaskAction.doExecute(DefaultTaskClassInfoStore.java:141)
  at org.gradle.api.internal.project.taskfactory.DefaultTaskClassInfoStore$StandardTaskAction.execute(DefaultTaskClassInfoStore.java:134)
  at org.gradle.api.internal.project.taskfactory.DefaultTaskClassInfoStore$StandardTaskAction.execute(DefaultTaskClassInfoStore.java:123)
  at org.gradle.api.internal.AbstractTask$TaskActionWrapper.execute(AbstractTask.java:692)
  at org.gradle.api.internal.AbstractTask$TaskActionWrapper.execute(AbstractTask.java:675)
  at org.gradle.api.internal.tasks.execution.ExecuteActionsTaskExecuter$1.execute(ExecuteActionsTaskExecuter.java:115)
  at org.gradle.api.internal.tasks.execution.ExecuteActionsTaskExecuter$1.execute(ExecuteActionsTaskExecuter.java:109)
  at org.gradle.internal.Transformers$4.transform(Transformers.java:169)
  at org.gradle.internal.progress.DefaultBuildOperationExecutor.run(DefaultBuildOperationExecutor.java:106)
  at org.gradle.internal.progress.DefaultBuildOperationExecutor.run(DefaultBuildOperationExecutor.java:56)
  at org.gradle.api.internal.tasks.execution.ExecuteActionsTaskExecuter.executeAction(ExecuteActionsTaskExecuter.java:109)
  at org.gradle.api.internal.tasks.execution.ExecuteActionsTaskExecuter.executeActions(ExecuteActionsTaskExecuter.java:90)
  ... 78 more
BUILD FAILED
Tags: Grails,3.3.9,2.5.6,Application, startup, failed


0
O log não ajuda muito, mas se fosse pra começar uma investigação o primeiro ponto que eu verificaria seria o acesso ao banco de dados.
Teste acessar o banco de dados usando algum cliente SQL (fora da sua aplicação) com os dados que foram incluídos no application.yml


0
Oi Kiko.

Esta configuração para banco de dados é a mesma que estou utilizando na aplicação da versão 2.5.6...

Vou continuar minha investigação...
30/09/2019 10:52



Ainda não faz parte da comunidade???

Para se registrar, clique aqui.


Aprenda Groovy e Grails com a Formação itexto!

Newsletter Semana Groovy

Assinar

Envie seu link!


Livro de Grails


/dev/All

Os melhores blogs de TI (e em português) em um único lugar!

 
Creative Commons
RSS Grails Brasil é mantido por itexto Consultoria.
Em caso de problemas contacte Henrique Lobo Weissmann (Kico) por e-mail: kico@itexto.com.br
Todo o conteúdo presente neste site adota o Creative Commons como licença padrão.
Ver: 4.14.0
itexto